{"text_format":"1","workbook":"xlsx","n_sheets":3,"sheets":["How it works","Tool","Funds"],"not_rendered":{"charts":0,"images":2,"macros":1,"external_links":0,"defined_names":2,"comments":0,"pivot_tables":0},"unopened":[],"bounds":{"document_bytes":16777216,"sheet_cells":100000,"rows_first":2000,"rows_last":500,"rows_between":2000,"halvings":0,"cell_chars":16384,"cell_head_chars":4096},"cells_cut":0,"cells_raw":0,"read":"whole","date_system":"1900"}

{"sheet":"How it works","index":0,"n_rows":47,"n_cols":3,"rows_kept":47,"cut":false,"hidden":false,"merged":[]}
[]
[null,null,"80-20 Investor Portfolio stress test"]
[]
[]
[null,null,"How to stress test your portfolio"]
[null,null,"The tool is useful for those trying to decide between funds within the same sector. The tool focuses on key measures which when combined show how your portfolio might perform under periods of stress. In each area a fund is awarded between 1 and 5 stars based on a number of factors below. The important point to note is that a rating is applied by comparing a fund with its peers from the same sector. So a 5 star rating in the UK All Companies Sector is not comparable to a 5 star rating from the Europe excluding UK sector."]
[]
[null,null,"Sharpe Ratio"]
[null,null,"The Sharpe Ratio is a measure of the excess return a manager is achieving for the risk they are taking. Therefore a fund which I've awarded 5 stars for its Sharpe Ratio takes more calculated risks and produces stronger returns for the risk being taken than other funds within the same sector. A fund with a 1 star rating will likely take excess risk for its investors and therefore is likely to struggle if markets fall versus its peers within the same sector."]
[]
[null,null,"Sortino Ratio"]
[null,null,"This is very similar to the Sharpe Ratio but places more emphasis on the manager's ability to manage on the downside."]
[]
[null,null,"Volatility"]
[null,null,"This is a measure of a fund's dispersion of returns, or in plain English the variability in those returns. Think of it as a measure of how much a building is prone to wobble. The more prone it is (the higher the volatility) the more it will sway in an earthquake. Again this is relative to the sector that the fund belongs to. So a 1 star rating on a bond fund would suggest it is volatile for a bond fund but it does not mean that it is more volatile than an equity fund with a 5 star rating. Clearly an equity fund will always be more volatile than a bond fund. That's why the ratings are sector specific."]
[]
[]
[null,null,"The next five factors are specific scenario stress tests. Each scenario occurred in recent years and usually represents the occasions during which equity markets (or sectors within it) fell by more than 10%. The nature of each scenario is slightly different which gives the ability to assess how each fund performed versus its peers within the same sector during a given scenario and therefore how the fund may perform in the future under stress."]
[]
[]
[null,null,"Trade war escalation"]
[null,null,"With the US and China embroiled in an on/off trade war the impact on global economic growth makes investment markets nervous. When there are tit-for-tat trade war threats there are clear winners and losers from an investment perspective (both on a sector level and an asset level). This stress test focuses on May 2019 when Donald Trump unexpectedly escalated the trade war which shook investment markets. This stress test looks at how a fund might underperform or outperform its peers from the same sector if the US-China trade war reignites/escalates or relations between the two superpowers sour."]
[]
[null,null,"Global pandemic / depression"]
[null,null,"The coronavirus pandemic of 2020 abruptly brought to a halt one of the longest bull markets in history. The pandemic sparked the fastest bear market on record with most major stock market indices falling 30-40% in a matter of weeks. Investment markets and investors' portfolios were placed under the greatest strain in decades. But it is the impact on economic growth and corporate profits as well as the possibility of a recession turning into a deep depression that this scenario also stress tests. This stress test looks at how a fund might underperform or outperform its peers from the same sector if a pandemic hits, or if we encounter an unexpected slump in economic growth of historic proportions."]
[]
[null,null,"Reflation / Value outperforms"]
[null,null,"Following the creation of a COVID-19 vaccine and the implementation of a vaccination programme in Europe, the US and the UK, economic growth rebounded strongly in 2021. The US Federal Reserve and other central banks were initially cautious about raising interest rates and removing the monetary stimulus that supported economic growth during the pandemic. Early signs of rising prices, and a lack of central bank intervention, caused investment markets to rapidly price in a significant rise in future inflation resulting in a large disparity in performance between different asset classes and investment funds. We saw a significant rotation out of growth stocks into value/cyclical stocks. The reflation/value scenario is a good test of what would happen during a period of strong economic growth and rising inflation, but also which funds would fare better in an environment where value outperforms growth."]
[]
[null,null,"Recession / aggressive Fed tightening"]
[null,null,"In the summer of 2022 the US Federal Reserve (the Fed) and other central banks continued to aggressively tighten monetary policy (i.e. raising interest rate) to try and control multi-decade high inflation. However investors started to become worried that such an aggressive policy stance would tip the US and other economies into a recession, given that there were already signs that high inflation was impacting consumer and business spending. In June/July 2022 bond markets began rapidly pricing in a recession and investors started rotating into defensive equity sectors. This is a good test to see how a fund may react versus its peers if the market suddenly starts pricing in a potential recession or how a fund may fare if we enter a recession."]
[]
[null,null,"Banking crisis"]
[null,null,"In March of 2023 the US Federal Reserve (the Fed) and other central banks had been aggressively raising interest rates for more than a year. However, this caused stress in regional US banks which were sitting on unrealised bond portfolio losses that were meant to ensure that they could meet large-scale customer withdrawals. After Silicon Valley Bank failed (which was the largest US banking failure since the 2008 financial crisis) it sparked a series of bank runs. The contagion spread to the UK and Europe where UBS was sanctioned to buy Credit Suisse in a rescue bid. This is a good test to see how a fund may react versus its peers if there is a banking crisis."]
[]
[null,null,"How to use the stress tool"]
[null,null,"Simply select the funds in your portfolio by clicking on the arrows that appear when you select one of the greyed out cells in column 'a' in the \"TOOL\" tab below."]
[]
[null,null,"If you choose a fund such as Fundsmith Equity you will see that it is in the Global sector. That means all the star ratings for each factor are in relation to the fund's global sector peers. To help scan across quickly the cells change colour with green being awarded to 5 stars and red for a 1 star. For numbers in between the colour ranges between the two."]
[]
{"$rows_left_out":8}
{"sheet":"Tool","index":1,"n_rows":40,"n_cols":12,"rows_kept":40,"cut":false,"hidden":false,"merged":[[0,5,0,9]]}
[null,null,null,null,null,"Scenarios (versus their peers from the same sector)"]
["Select Fund","Sector","Sharpe ratio","Sortino Ratio","Volatility","Trade war escalation","Pandemic / depression","Reflation / Value outperforms growth","Recession /Aggressive Fed","Banking crisis","Average stars"]
["Fundsmith Equity ",{"$f":"IF(A3=\"\",\"\",VLOOKUP($A3,Funds!$A$1:$I$2154,2,0))","v":"Global"},{"$f":"IF(A3=\"\",\"\",6-VLOOKUP($A3,Funds!$A$1:$J$2154,3,0))","v":5},{"$f":"IF(A3=\"\",\"\",6-VLOOKUP($A3,Funds!$A$1:$J$2154,4,0))","v":5},{"$f":"IF(A3=\"\",\"\",6-VLOOKUP($A3,Funds!$A$1:$J$2154,5,0))","v":4},{"$f":"IF(A3=\"\",\"\",6-VLOOKUP($A3,Funds!$A$1:$J$2154,6,0))","v":5},{"$f":"IF(A3=\"\",\"\",6-VLOOKUP($A3,Funds!$A$1:$J$2154,7,0))","v":5},{"$f":"IF(A3=\"\",\"\",6-VLOOKUP($A3,Funds!$A$1:$J$2154,8,0))","v":2},{"$f":"IF(A3=\"\",\"\",6-VLOOKUP($A3,Funds!$A$1:$J$2154,9,0))","v":5},{"$f":"IF(A3=\"\",\"\",6-VLOOKUP($A3,Funds!$A$1:$J$2154,10,0))","v":5},{"$f":"IF(A3=\"\",\"\",AVERAGEIF(C3:J3,\"<6\",C3:J3))","v":4.5}," "]
[null,{"$f":"IF(A4=\"\",\"\",VLOOKUP($A4,Funds!$A$1:$I$2154,2,0))","v":""},{"$f":"IF(A4=\"\",\"\",6-VLOOKUP($A4,Funds!$A$1:$J$2154,3,0))","v":""},{"$f":"IF(A4=\"\",\"\",6-VLOOKUP($A4,Funds!$A$1:$J$2154,4,0))","v":""},{"$f":"IF(A4=\"\",\"\",6-VLOOKUP($A4,Funds!$A$1:$J$2154,5,0))","v":""},{"$f":"IF(A4=\"\",\"\",6-VLOOKUP($A4,Funds!$A$1:$J$2154,6,0))","v":""},{"$f":"IF(A4=\"\",\"\",6-VLOOKUP($A4,Funds!$A$1:$J$2154,7,0))","v":""},{"$f":"IF(A4=\"\",\"\",6-VLOOKUP($A4,Funds!$A$1:$J$2154,8,0))","v":""},{"$f":"IF(A4=\"\",\"\",6-VLOOKUP($A4,Funds!$A$1:$J$2154,9,0))","v":""},{"$f":"IF(A4=\"\",\"\",6-VLOOKUP($A4,Funds!$A$1:$J$2154,10,0))","v":""},{"$f":"IF(A4=\"\",\"\",AVERAGEIF(C4:J4,\"<6\",C4:J4))","v":""}]
[null,{"$f":"IF(A5=\"\",\"\",VLOOKUP($A5,Funds!$A$1:$I$2154,2,0))","v":""},{"$f":"IF(A5=\"\",\"\",6-VLOOKUP($A5,Funds!$A$1:$J$2154,3,0))","v":""},{"$f":"IF(A5=\"\",\"\",6-VLOOKUP($A5,Funds!$A$1:$J$2154,4,0))","v":""},{"$f":"IF(A5=\"\",\"\",6-VLOOKUP($A5,Funds!$A$1:$J$2154,5,0))","v":""},{"$f":"IF(A5=\"\",\"\",6-VLOOKUP($A5,Funds!$A$1:$J$2154,6,0))","v":""},{"$f":"IF(A5=\"\",\"\",6-VLOOKUP($A5,Funds!$A$1:$J$2154,7,0))","v":""},{"$f":"IF(A5=\"\",\"\",6-VLOOKUP($A5,Funds!$A$1:$J$2154,8,0))","v":""},{"$f":"IF(A5=\"\",\"\",6-VLOOKUP($A5,Funds!$A$1:$J$2154,9,0))","v":""},{"$f":"IF(A5=\"\",\"\",6-VLOOKUP($A5,Funds!$A$1:$J$2154,10,0))","v":""},""]
[null,{"$f":"IF(A6=\"\",\"\",VLOOKUP($A6,Funds!$A$1:$I$2154,2,0))","v":""},{"$f":"IF(A6=\"\",\"\",6-VLOOKUP($A6,Funds!$A$1:$J$2154,3,0))","v":""},{"$f":"IF(A6=\"\",\"\",6-VLOOKUP($A6,Funds!$A$1:$J$2154,4,0))","v":""},{"$f":"IF(A6=\"\",\"\",6-VLOOKUP($A6,Funds!$A$1:$J$2154,5,0))","v":""},{"$f":"IF(A6=\"\",\"\",6-VLOOKUP($A6,Funds!$A$1:$J$2154,6,0))","v":""},{"$f":"IF(A6=\"\",\"\",6-VLOOKUP($A6,Funds!$A$1:$J$2154,7,0))","v":""},{"$f":"IF(A6=\"\",\"\",6-VLOOKUP($A6,Funds!$A$1:$J$2154,8,0))","v":""},{"$f":"IF(A6=\"\",\"\",6-VLOOKUP($A6,Funds!$A$1:$J$2154,9,0))","v":""},{"$f":"IF(A6=\"\",\"\",6-VLOOKUP($A6,Funds!$A$1:$J$2154,10,0))","v":""},""]
[null,{"$f":"IF(A7=\"\",\"\",VLOOKUP($A7,Funds!$A$1:$I$2154,2,0))","v":""},{"$f":"IF(A7=\"\",\"\",6-VLOOKUP($A7,Funds!$A$1:$J$2154,3,0))","v":""},{"$f":"IF(A7=\"\",\"\",6-VLOOKUP($A7,Funds!$A$1:$J$2154,4,0))","v":""},{"$f":"IF(A7=\"\",\"\",6-VLOOKUP($A7,Funds!$A$1:$J$2154,5,0))","v":""},{"$f":"IF(A7=\"\",\"\",6-VLOOKUP($A7,Funds!$A$1:$J$2154,6,0))","v":""},{"$f":"IF(A7=\"\",\"\",6-VLOOKUP($A7,Funds!$A$1:$J$2154,7,0))","v":""},{"$f":"IF(A7=\"\",\"\",6-VLOOKUP($A7,Funds!$A$1:$J$2154,8,0))","v":""},{"$f":"IF(A7=\"\",\"\",6-VLOOKUP($A7,Funds!$A$1:$J$2154,9,0))","v":""},{"$f":"IF(A7=\"\",\"\",6-VLOOKUP($A7,Funds!$A$1:$J$2154,10,0))","v":""},""]
[null,{"$f":"IF(A8=\"\",\"\",VLOOKUP($A8,Funds!$A$1:$I$2154,2,0))","v":""},{"$f":"IF(A8=\"\",\"\",6-VLOOKUP($A8,Funds!$A$1:$J$2154,3,0))","v":""},{"$f":"IF(A8=\"\",\"\",6-VLOOKUP($A8,Funds!$A$1:$J$2154,4,0))","v":""},{"$f":"IF(A8=\"\",\"\",6-VLOOKUP($A8,Funds!$A$1:$J$2154,5,0))","v":""},{"$f":"IF(A8=\"\",\"\",6-VLOOKUP($A8,Funds!$A$1:$J$2154,6,0))","v":""},{"$f":"IF(A8=\"\",\"\",6-VLOOKUP($A8,Funds!$A$1:$J$2154,7,0))","v":""},{"$f":"IF(A8=\"\",\"\",6-VLOOKUP($A8,Funds!$A$1:$J$2154,8,0))","v":""},{"$f":"IF(A8=\"\",\"\",6-VLOOKUP($A8,Funds!$A$1:$J$2154,9,0))","v":""},{"$f":"IF(A8=\"\",\"\",6-VLOOKUP($A8,Funds!$A$1:$J$2154,10,0))","v":""},""]
[null,{"$f":"IF(A9=\"\",\"\",VLOOKUP($A9,Funds!$A$1:$I$2154,2,0))","v":""},{"$f":"IF(A9=\"\",\"\",6-VLOOKUP($A9,Funds!$A$1:$J$2154,3,0))","v":""},{"$f":"IF(A9=\"\",\"\",6-VLOOKUP($A9,Funds!$A$1:$J$2154,4,0))","v":""},{"$f":"IF(A9=\"\",\"\",6-VLOOKUP($A9,Funds!$A$1:$J$2154,5,0))","v":""},{"$f":"IF(A9=\"\",\"\",6-VLOOKUP($A9,Funds!$A$1:$J$2154,6,0))","v":""},{"$f":"IF(A9=\"\",\"\",6-VLOOKUP($A9,Funds!$A$1:$J$2154,7,0))","v":""},{"$f":"IF(A9=\"\",\"\",6-VLOOKUP($A9,Funds!$A$1:$J$2154,8,0))","v":""},{"$f":"IF(A9=\"\",\"\",6-VLOOKUP($A9,Funds!$A$1:$J$2154,9,0))","v":""},{"$f":"IF(A9=\"\",\"\",6-VLOOKUP($A9,Funds!$A$1:$J$2154,10,0))","v":""},""]
[null,{"$f":"IF(A10=\"\",\"\",VLOOKUP($A10,Funds!$A$1:$I$2154,2,0))","v":""},{"$f":"IF(A10=\"\",\"\",6-VLOOKUP($A10,Funds!$A$1:$J$2154,3,0))","v":""},{"$f":"IF(A10=\"\",\"\",6-VLOOKUP($A10,Funds!$A$1:$J$2154,4,0))","v":""},{"$f":"IF(A10=\"\",\"\",6-VLOOKUP($A10,Funds!$A$1:$J$2154,5,0))","v":""},{"$f":"IF(A10=\"\",\"\",6-VLOOKUP($A10,Funds!$A$1:$J$2154,6,0))","v":""},{"$f":"IF(A10=\"\",\"\",6-VLOOKUP($A10,Funds!$A$1:$J$2154,7,0))","v":""},{"$f":"IF(A10=\"\",\"\",6-VLOOKUP($A10,Funds!$A$1:$J$2154,8,0))","v":""},{"$f":"IF(A10=\"\",\"\",6-VLOOKUP($A10,Funds!$A$1:$J$2154,9,0))","v":""},{"$f":"IF(A10=\"\",\"\",6-VLOOKUP($A10,Funds!$A$1:$J$2154,10,0))","v":""},""]
[null,{"$f":"IF(A11=\"\",\"\",VLOOKUP($A11,Funds!$A$1:$I$2154,2,0))","v":""},{"$f":"IF(A11=\"\",\"\",6-VLOOKUP($A11,Funds!$A$1:$J$2154,3,0))","v":""},{"$f":"IF(A11=\"\",\"\",6-VLOOKUP($A11,Funds!$A$1:$J$2154,4,0))","v":""},{"$f":"IF(A11=\"\",\"\",6-VLOOKUP($A11,Funds!$A$1:$J$2154,5,0))","v":""},{"$f":"IF(A11=\"\",\"\",6-VLOOKUP($A11,Funds!$A$1:$J$2154,6,0))","v":""},{"$f":"IF(A11=\"\",\"\",6-VLOOKUP($A11,Funds!$A$1:$J$2154,7,0))","v":""},{"$f":"IF(A11=\"\",\"\",6-VLOOKUP($A11,Funds!$A$1:$J$2154,8,0))","v":""},{"$f":"IF(A11=\"\",\"\",6-VLOOKUP($A11,Funds!$A$1:$J$2154,9,0))","v":""},{"$f":"IF(A11=\"\",\"\",6-VLOOKUP($A11,Funds!$A$1:$J$2154,10,0))","v":""},""]
[null,{"$f":"IF(A12=\"\",\"\",VLOOKUP($A12,Funds!$A$1:$I$2154,2,0))","v":""},{"$f":"IF(A12=\"\",\"\",6-VLOOKUP($A12,Funds!$A$1:$J$2154,3,0))","v":""},{"$f":"IF(A12=\"\",\"\",6-VLOOKUP($A12,Funds!$A$1:$J$2154,4,0))","v":""},{"$f":"IF(A12=\"\",\"\",6-VLOOKUP($A12,Funds!$A$1:$J$2154,5,0))","v":""},{"$f":"IF(A12=\"\",\"\",6-VLOOKUP($A12,Funds!$A$1:$J$2154,6,0))","v":""},{"$f":"IF(A12=\"\",\"\",6-VLOOKUP($A12,Funds!$A$1:$J$2154,7,0))","v":""},{"$f":"IF(A12=\"\",\"\",6-VLOOKUP($A12,Funds!$A$1:$J$2154,8,0))","v":""},{"$f":"IF(A12=\"\",\"\",6-VLOOKUP($A12,Funds!$A$1:$J$2154,9,0))","v":""},{"$f":"IF(A12=\"\",\"\",6-VLOOKUP($A12,Funds!$A$1:$J$2154,10,0))","v":""},""]
[null,{"$f":"IF(A13=\"\",\"\",VLOOKUP($A13,Funds!$A$1:$I$2154,2,0))","v":""},{"$f":"IF(A13=\"\",\"\",6-VLOOKUP($A13,Funds!$A$1:$J$2154,3,0))","v":""},{"$f":"IF(A13=\"\",\"\",6-VLOOKUP($A13,Funds!$A$1:$J$2154,4,0))","v":""},{"$f":"IF(A13=\"\",\"\",6-VLOOKUP($A13,Funds!$A$1:$J$2154,5,0))","v":""},{"$f":"IF(A13=\"\",\"\",6-VLOOKUP($A13,Funds!$A$1:$J$2154,6,0))","v":""},{"$f":"IF(A13=\"\",\"\",6-VLOOKUP($A13,Funds!$A$1:$J$2154,7,0))","v":""},{"$f":"IF(A13=\"\",\"\",6-VLOOKUP($A13,Funds!$A$1:$J$2154,8,0))","v":""},{"$f":"IF(A13=\"\",\"\",6-VLOOKUP($A13,Funds!$A$1:$J$2154,9,0))","v":""},{"$f":"IF(A13=\"\",\"\",6-VLOOKUP($A13,Funds!$A$1:$J$2154,10,0))","v":""},""]
[null,{"$f":"IF(A14=\"\",\"\",VLOOKUP($A14,Funds!$A$1:$I$2154,2,0))","v":""},{"$f":"IF(A14=\"\",\"\",6-VLOOKUP($A14,Funds!$A$1:$J$2154,3,0))","v":""},{"$f":"IF(A14=\"\",\"\",6-VLOOKUP($A14,Funds!$A$1:$J$2154,4,0))","v":""},{"$f":"IF(A14=\"\",\"\",6-VLOOKUP($A14,Funds!$A$1:$J$2154,5,0))","v":""},{"$f":"IF(A14=\"\",\"\",6-VLOOKUP($A14,Funds!$A$1:$J$2154,6,0))","v":""},{"$f":"IF(A14=\"\",\"\",6-VLOOKUP($A14,Funds!$A$1:$J$2154,7,0))","v":""},{"$f":"IF(A14=\"\",\"\",6-VLOOKUP($A14,Funds!$A$1:$J$2154,8,0))","v":""},{"$f":"IF(A14=\"\",\"\",6-VLOOKUP($A14,Funds!$A$1:$J$2154,9,0))","v":""},{"$f":"IF(A14=\"\",\"\",6-VLOOKUP($A14,Funds!$A$1:$J$2154,10,0))","v":""},""]
[null,{"$f":"IF(A15=\"\",\"\",VLOOKUP($A15,Funds!$A$1:$I$2154,2,0))","v":""},{"$f":"IF(A15=\"\",\"\",6-VLOOKUP($A15,Funds!$A$1:$J$2154,3,0))","v":""},{"$f":"IF(A15=\"\",\"\",6-VLOOKUP($A15,Funds!$A$1:$J$2154,4,0))","v":""},{"$f":"IF(A15=\"\",\"\",6-VLOOKUP($A15,Funds!$A$1:$J$2154,5,0))","v":""},{"$f":"IF(A15=\"\",\"\",6-VLOOKUP($A15,Funds!$A$1:$J$2154,6,0))","v":""},{"$f":"IF(A15=\"\",\"\",6-VLOOKUP($A15,Funds!$A$1:$J$2154,7,0))","v":""},{"$f":"IF(A15=\"\",\"\",6-VLOOKUP($A15,Funds!$A$1:$J$2154,8,0))","v":""},{"$f":"IF(A15=\"\",\"\",6-VLOOKUP($A15,Funds!$A$1:$J$2154,9,0))","v":""},{"$f":"IF(A15=\"\",\"\",6-VLOOKUP($A15,Funds!$A$1:$J$2154,10,0))","v":""},""]
[null,{"$f":"IF(A16=\"\",\"\",VLOOKUP($A16,Funds!$A$1:$I$2154,2,0))","v":""},{"$f":"IF(A16=\"\",\"\",6-VLOOKUP($A16,Funds!$A$1:$J$2154,3,0))","v":""},{"$f":"IF(A16=\"\",\"\",6-VLOOKUP($A16,Funds!$A$1:$J$2154,4,0))","v":""},{"$f":"IF(A16=\"\",\"\",6-VLOOKUP($A16,Funds!$A$1:$J$2154,5,0))","v":""},{"$f":"IF(A16=\"\",\"\",6-VLOOKUP($A16,Funds!$A$1:$J$2154,6,0))","v":""},{"$f":"IF(A16=\"\",\"\",6-VLOOKUP($A16,Funds!$A$1:$J$2154,7,0))","v":""},{"$f":"IF(A16=\"\",\"\",6-VLOOKUP($A16,Funds!$A$1:$J$2154,8,0))","v":""},{"$f":"IF(A16=\"\",\"\",6-VLOOKUP($A16,Funds!$A$1:$J$2154,9,0))","v":""},{"$f":"IF(A16=\"\",\"\",6-VLOOKUP($A16,Funds!$A$1:$J$2154,10,0))","v":""},""]
[null,{"$f":"IF(A17=\"\",\"\",VLOOKUP($A17,Funds!$A$1:$I$2154,2,0))","v":""},{"$f":"IF(A17=\"\",\"\",6-VLOOKUP($A17,Funds!$A$1:$J$2154,3,0))","v":""},{"$f":"IF(A17=\"\",\"\",6-VLOOKUP($A17,Funds!$A$1:$J$2154,4,0))","v":""},{"$f":"IF(A17=\"\",\"\",6-VLOOKUP($A17,Funds!$A$1:$J$2154,5,0))","v":""},{"$f":"IF(A17=\"\",\"\",6-VLOOKUP($A17,Funds!$A$1:$J$2154,6,0))","v":""},{"$f":"IF(A17=\"\",\"\",6-VLOOKUP($A17,Funds!$A$1:$J$2154,7,0))","v":""},{"$f":"IF(A17=\"\",\"\",6-VLOOKUP($A17,Funds!$A$1:$J$2154,8,0))","v":""},{"$f":"IF(A17=\"\",\"\",6-VLOOKUP($A17,Funds!$A$1:$J$2154,9,0))","v":""},{"$f":"IF(A17=\"\",\"\",6-VLOOKUP($A17,Funds!$A$1:$J$2154,10,0))","v":""},""]
[null,{"$f":"IF(A18=\"\",\"\",VLOOKUP($A18,Funds!$A$1:$I$2154,2,0))","v":""},{"$f":"IF(A18=\"\",\"\",6-VLOOKUP($A18,Funds!$A$1:$J$2154,3,0))","v":""},{"$f":"IF(A18=\"\",\"\",6-VLOOKUP($A18,Funds!$A$1:$J$2154,4,0))","v":""},{"$f":"IF(A18=\"\",\"\",6-VLOOKUP($A18,Funds!$A$1:$J$2154,5,0))","v":""},{"$f":"IF(A18=\"\",\"\",6-VLOOKUP($A18,Funds!$A$1:$J$2154,6,0))","v":""},{"$f":"IF(A18=\"\",\"\",6-VLOOKUP($A18,Funds!$A$1:$J$2154,7,0))","v":""},{"$f":"IF(A18=\"\",\"\",6-VLOOKUP($A18,Funds!$A$1:$J$2154,8,0))","v":""},{"$f":"IF(A18=\"\",\"\",6-VLOOKUP($A18,Funds!$A$1:$J$2154,9,0))","v":""},{"$f":"IF(A18=\"\",\"\",6-VLOOKUP($A18,Funds!$A$1:$J$2154,10,0))","v":""},""]
[null,{"$f":"IF(A19=\"\",\"\",VLOOKUP($A19,Funds!$A$1:$I$2154,2,0))","v":""},{"$f":"IF(A19=\"\",\"\",6-VLOOKUP($A19,Funds!$A$1:$J$2154,3,0))","v":""},{"$f":"IF(A19=\"\",\"\",6-VLOOKUP($A19,Funds!$A$1:$J$2154,4,0))","v":""},{"$f":"IF(A19=\"\",\"\",6-VLOOKUP($A19,Funds!$A$1:$J$2154,5,0))","v":""},{"$f":"IF(A19=\"\",\"\",6-VLOOKUP($A19,Funds!$A$1:$J$2154,6,0))","v":""},{"$f":"IF(A19=\"\",\"\",6-VLOOKUP($A19,Funds!$A$1:$J$2154,7,0))","v":""},{"$f":"IF(A19=\"\",\"\",6-VLOOKUP($A19,Funds!$A$1:$J$2154,8,0))","v":""},{"$f":"IF(A19=\"\",\"\",6-VLOOKUP($A19,Funds!$A$1:$J$2154,9,0))","v":""},{"$f":"IF(A19=\"\",\"\",6-VLOOKUP($A19,Funds!$A$1:$J$2154,10,0))","v":""},""]
[null,{"$f":"IF(A20=\"\",\"\",VLOOKUP($A20,Funds!$A$1:$I$2154,2,0))","v":""},{"$f":"IF(A20=\"\",\"\",6-VLOOKUP($A20,Funds!$A$1:$J$2154,3,0))","v":""},{"$f":"IF(A20=\"\",\"\",6-VLOOKUP($A20,Funds!$A$1:$J$2154,4,0))","v":""},{"$f":"IF(A20=\"\",\"\",6-VLOOKUP($A20,Funds!$A$1:$J$2154,5,0))","v":""},{"$f":"IF(A20=\"\",\"\",6-VLOOKUP($A20,Funds!$A$1:$J$2154,6,0))","v":""},{"$f":"IF(A20=\"\",\"\",6-VLOOKUP($A20,Funds!$A$1:$J$2154,7,0))","v":""},{"$f":"IF(A20=\"\",\"\",6-VLOOKUP($A20,Funds!$A$1:$J$2154,8,0))","v":""},{"$f":"IF(A20=\"\",\"\",6-VLOOKUP($A20,Funds!$A$1:$J$2154,9,0))","v":""},{"$f":"IF(A20=\"\",\"\",6-VLOOKUP($A20,Funds!$A$1:$J$2154,10,0))","v":""},""]
[null,{"$f":"IF(A21=\"\",\"\",VLOOKUP($A21,Funds!$A$1:$I$2154,2,0))","v":""},{"$f":"IF(A21=\"\",\"\",6-VLOOKUP($A21,Funds!$A$1:$J$2154,3,0))","v":""},{"$f":"IF(A21=\"\",\"\",6-VLOOKUP($A21,Funds!$A$1:$J$2154,4,0))","v":""},{"$f":"IF(A21=\"\",\"\",6-VLOOKUP($A21,Funds!$A$1:$J$2154,5,0))","v":""},{"$f":"IF(A21=\"\",\"\",6-VLOOKUP($A21,Funds!$A$1:$J$2154,6,0))","v":""},{"$f":"IF(A21=\"\",\"\",6-VLOOKUP($A21,Funds!$A$1:$J$2154,7,0))","v":""},{"$f":"IF(A21=\"\",\"\",6-VLOOKUP($A21,Funds!$A$1:$J$2154,8,0))","v":""},{"$f":"IF(A21=\"\",\"\",6-VLOOKUP($A21,Funds!$A$1:$J$2154,9,0))","v":""},{"$f":"IF(A21=\"\",\"\",6-VLOOKUP($A21,Funds!$A$1:$J$2154,10,0))","v":""},""]
[null,{"$f":"IF(A22=\"\",\"\",VLOOKUP($A22,Funds!$A$1:$I$2154,2,0))","v":""},{"$f":"IF(A22=\"\",\"\",6-VLOOKUP($A22,Funds!$A$1:$J$2154,3,0))","v":""},{"$f":"IF(A22=\"\",\"\",6-VLOOKUP($A22,Funds!$A$1:$J$2154,4,0))","v":""},{"$f":"IF(A22=\"\",\"\",6-VLOOKUP($A22,Funds!$A$1:$J$2154,5,0))","v":""},{"$f":"IF(A22=\"\",\"\",6-VLOOKUP($A22,Funds!$A$1:$J$2154,6,0))","v":""},{"$f":"IF(A22=\"\",\"\",6-VLOOKUP($A22,Funds!$A$1:$J$2154,7,0))","v":""},{"$f":"IF(A22=\"\",\"\",6-VLOOKUP($A22,Funds!$A$1:$J$2154,8,0))","v":""},{"$f":"IF(A22=\"\",\"\",6-VLOOKUP($A22,Funds!$A$1:$J$2154,9,0))","v":""},{"$f":"IF(A22=\"\",\"\",6-VLOOKUP($A22,Funds!$A$1:$J$2154,10,0))","v":""},""]
[null,null,null,null,null,null,null,null,null,"Portfolio average",{"$f":"IFERROR(AVERAGE(K3:K22),\"\")","v":4.5}]
[]
[]
[]
[]
[]
[]
[]
[]
[]
[]
[]
[]
[]
[]
[]
[]
[null,"This tool belongs to MoneytotheMasses.com and you are permitted to use it as a paid subscriber of the 80-20 Investor service."]
{"$rows_left_out":1}
{"sheet":"Funds","index":2,"n_rows":1979,"n_cols":10,"rows_kept":1979,"cut":false,"hidden":false,"merged":[]}
["Name","Member Of","Rank Qnl","Rank Qnl","Rank Qnl","Rank Qnl","Rank Qnl","Rank Qnl","Rank Qnl","Rank Qnl"]
["7IM AAP Adventurous ","Flexible Investment",2,2,2,4,4,2,1,5]
["7IM AAP Balanced ","Mixed Investment 20-60% Shares",2,4,2,4,3,2,2,5]
["7IM AAP Income ","Mixed Investment 0-35% Shares ",3,4,3,3,5,3,5,4]
["7IM AAP Moderately Adventurous ","Mixed Investment 40-85% Shares",1,3,1,4,2,2,2,5]
["7IM AAP Moderately Cautious ","Mixed Investment 20-60% Shares",3,5,2,2,1,4,2,4]
["7IM Absolute Return Portfolio ","Targeted Absolute Return ",2,4,1,1,2,2,4,2]
["7IM Adventurous ","Flexible Investment",2,2,3,5,4,2,1,5]
["7IM Balanced ","Mixed Investment 20-60% Shares",2,2,2,5,3,2,4,5]
["7IM Cautious ","Mixed Investment 0-35% Shares ",3,5,2,2,1,4,2,4]
["7IM Income Portfolio","Mixed Investment 0-35% Shares ",2,5,2,5,4,4,5,2]
["7IM Moderately Adventurous ","Mixed Investment 40-85% Shares",1,2,2,4,3,2,3,5]
["7IM Moderately Cautious ","Mixed Investment 20-60% Shares",3,4,2,2,1,4,4,3]
["7IM Personal Injury ","Mixed Investment 0-35% Shares ",3,5,2,3,1,4,2,4]
["7IM Real Return ","Targeted Absolute Return ",2,2,2,3,3,3,5,4]
["7IM Select Adventurous ","Mixed Investment 40-85% Shares",1,2,2,null,3,1,1,5]
["7IM Select Balanced ","Mixed Investment 20-60% Shares",1,2,2,null,2,2,3,5]
["7IM Select Moderately Adventurous ","Mixed Investment 40-85% Shares",1,3,1,null,2,1,3,5]
["7IM Select Moderately Cautious ","Mixed Investment 20-60% Shares",2,5,1,null,1,2,3,3]
["7IM Sustainable Balance ","Mixed Investment 20-60% Shares",5,3,5,2,3,4,1,3]
["Aberdeen LF abrdn Income Focus ","UK Equity Income ",4,4,4,5,4,5,3,3]
["Aberforth UK Small Companies ","UK Smaller Companies ",1,1,3,4,5,1,5,4]
["abrdn (AAM) Sterling Government Bond ","UK Gilts ",3,3,3,1,2,4,2,2]
["abrdn (AAM) UK Smaller Companies ","UK Smaller Companies ",5,4,5,1,3,5,1,1]
["abrdn AAA Bond ","Sterling Corporate Bond ",2,4,1,1,1,2,1,1]
["abrdn American Equity ","North America ",5,5,1,1,2,3,4,4]
["abrdn American Equity Enhanced Index ","North America ",2,4,1,4,3,3,3,2]
["abrdn American Income Equity ","North America ",1,5,1,2,2,2,2,4]
["abrdn American Unconstrained Equity ","North America ",4,5,1,1,2,2,3,5]
["abrdn Asia Pacific Equity ","Asia Pacific Excluding Japan ",3,3,3,2,2,5,2,4]
["abrdn Asia Pacific Equity Enhanced Index ","Asia Pacific Excluding Japan ",3,3,2,4,3,3,3,3]
["abrdn Asian Pacific Growth Equity ","Asia Pacific Excluding Japan ",4,4,3,3,2,5,2,5]
["abrdn Balanced Bridge ","Mixed Investment 40-85% Shares",2,4,1,2,1,5,2,1]
["abrdn Bridge ","Flexible Investment",4,4,4,2,2,5,1,2]
["abrdn Diversified Growth ","Specialist ",3,4,2,4,4,3,3,3]
["abrdn Diversified Income ","Mixed Investment 20-60% Shares",3,2,3,4,4,4,1,2]
["abrdn Dynamic Distribution ","Mixed Investment 20-60% Shares",2,3,3,5,5,4,4,4]
["abrdn Dynamic Multi Asset Growth ","Specialist ",4,3,3,5,4,4,1,2]
["abrdn Emerging Markets Equity ","Global Emerging Markets ",3,3,2,2,4,5,3,2]
["abrdn Emerging Markets Equity Enhanced Index","Global Emerging Markets ",3,3,2,4,2,2,4,2]
{"$rows_left_out":1939}